Welcome to the forums. Please post in English or French.

You are not logged in.

#1 2016-03-29 07:25:44

jeanpierreaubry
Guru
From: nantes (france)
Registered: 2009-03-12
Posts: 3,616

[SOLVED]trouble with update of DEV version

hello

i have the following trouble while trying to update a DEV version

waf configure ends up successfully
then waf install -p ends up with the un-understandable (for me at least) msg
it used to work a few weeks ago

Write config file                        : release/asterc_config.h
'configure' finished successfully (4.179s)
No function   defined in /home/dedalus/dev/codeaster/src/wscript
..........
Waf: Entering directory `/home/dedalus/dev/codeaster/src/build/release'
/home/dedalus/dev/codeaster/src/bibfor/cont_pair/aprema.F90:20:0: fatal error: mpif.h: No such file or directory
 #include "mpif.h"
 ^
compilation terminated.
/home/dedalus/dev/codeaster/src/bibfor/cont_pair/aprend.F90:19:0: fatal error: mpif.h: No such file or directory
 #include "mpif.h"
 ^
compilation terminated.
/home/dedalus/dev/codeaster/src/bibfor/cont_pair/aptgem.F90:28:0: fatal error: mpif.h: No such file or directory
 #include "mpif.h"
 ^
compilation terminated.
[47/47][100%][\][=======================================================>][8.976s]
Waf: Leaving directory `/home/dedalus/dev/codeaster/src/build/release'
Build failed
 -> task in 'asterbibfor' failed (exit status 1):
    full report in: /home/dedalus/dev/codeaster/src/build/release/asterbibfor.log
 -> task in 'asterbibfor' failed (exit status 1):
    full report in: /home/dedalus/dev/codeaster/src/build/release/asterbibfor.log
 -> task in 'asterbibfor' failed (exit status 1):
    full report in: /home/dedalus/dev/codeaster/src/build/release/asterbibfor.log

reading this log does not tell me more

jean pierre aubry

Last edited by jeanpierreaubry (2016-04-08 12:28:33)

Offline

#2 2016-03-29 18:20:14

AsterO'dactyle
Administrator
Registered: 2007-11-29
Posts: 292

Re: [SOLVED]trouble with update of DEV version

The problem will been corrected this week


Code_Asterの開発者

Offline

#3 2016-03-30 06:12:17

jeanpierreaubry
Guru
From: nantes (france)
Registered: 2009-03-12
Posts: 3,616

Re: [SOLVED]trouble with update of DEV version

hello

thanks
fast as light, almost !
as usual

jean pierre aubry

Offline